activated-a
type: LexicalEntry
canonical form: activated
sense: 00035037-s
part of speech: adjective

00035037-s
type: LexicalConcept
in scheme: en-word.net
definition: (military) set up and placed on active assignment
example: a newly activated unit
ili: i171
lexfile: adj.all
part of speech: adjective satellite
domain topic: 08215965-n
similar: https://en-word.net/synset/00034823-a