blow-v
type: LexicalEntry
canonical form: blow
sense: 00034941-v
part of speech: verb

00034941-v
type: LexicalConcept
in scheme: en-word.net
definition: free of obstruction by blowing air through
example: blow one's nose
ili: i21940
lexfile: verb.body
part of speech: verb
hypernym: 00104622-v