shrug-v
type: LexicalEntry
canonical form: shrug
sense: 00033948-v
part of speech: verb

00033948-v
type: LexicalConcept
in scheme: en-word.net
definition: raise one's shoulders to indicate indifference or resignation
ili: i21935
lexfile: verb.body
part of speech: verb
hypernym: 00994073-v