break down-v
type: LexicalEntry
canonical form: break down
sense: 00030640-v
part of speech: verb

collapse-v
type: LexicalEntry
canonical form: collapse
sense: 00030640-v
part of speech: verb

00030640-v
type: LexicalConcept
in scheme: en-word.net
definition: collapse due to fatigue, an illness, or a sudden attack
ili: i21917
lexfile: verb.body
part of speech: verb
hypernym: 00065410-v