beam-v
type: LexicalEntry
canonical form: beam
sense: 00029207-v
part of speech: verb

00029207-v
type: LexicalConcept
in scheme: en-word.net
definition: smile radiantly; express joy through one's facial expression
ili: i21907
lexfile: verb.body
part of speech: verb
hypernym: 00028558-v