tight-a
type: LexicalEntry
canonical form: tight
sense: 00017224-s
part of speech: adjective

00017224-s
type: LexicalConcept
in scheme: en-word.net
definition: affected by scarcity and expensive to borrow
example: tight money
example: a tight market
ili: i80
lexfile: adj.all
part of speech: adjective satellite
domain topic: 06158935-n
similar: https://en-word.net/synset/00016794-a