zonk out-v
type: LexicalEntry
canonical form: zonk out
sense: 00016848-v
part of speech: verb

00016848-v
type: LexicalConcept
in scheme: en-word.net
definition: fall asleep fast, as when one is extremely tired
example: after the long drive, we zonked out and slept for 10 hours
ili: i21851
lexfile: verb.body
part of speech: verb
hypernym: 00017275-v