play-v
type: LexicalEntry
canonical form: play
sense: 00013321-v
part of speech: verb

toy-v
type: LexicalEntry
canonical form: toy
sense: 00013321-v
part of speech: verb

00013321-v
type: LexicalConcept
in scheme: en-word.net
definition: engage in an activity as if it were a game rather than take it seriously
example: They played games on their opponents
example: play the stock market
example: play with her feelings
example: toy with an idea
ili: i21833
lexfile: verb.body
part of speech: verb
hypernym: 00010428-v