wince-v
type: LexicalEntry
canonical form: wince
sense: 00008970-v
part of speech: verb

00008970-v
type: LexicalConcept
in scheme: en-word.net
definition: make a face indicating disgust or dislike
example: She winced when she heard his pompous speech
ili: i21812
lexfile: verb.body
part of speech: verb
hypernym: 00034281-v