sigh-v
type: LexicalEntry
canonical form: sigh
sense: 00004032-v
part of speech: verb

suspire-v
type: LexicalEntry
canonical form: suspire
sense: 00004032-v
part of speech: verb

00004032-v
type: LexicalConcept
in scheme: en-word.net
definition: heave or utter a sigh; breathe deeply and heavily
example: She sighed sadly
ili: i21788
lexfile: verb.body
part of speech: verb
hypernym: 00001740-v