write in-v
type: LexicalEntry
canonical form: write in
sense: 00995498-v
part of speech: verb
sense: 02467230-v

00995498-v
type: LexicalConcept
in scheme: en-word.net
definition: write to an organization
example: Many listeners wrote in after the controversial radio program
ili: i26549
lexfile: verb.communication
part of speech: verb
hypernym: 00995046-v

02467230-v
type: LexicalConcept
in scheme: en-word.net
definition: cast a vote by inserting a name that does not appear on the ballot
example: Many voters wrote in the names of strangers
ili: i34027
lexfile: verb.social
part of speech: verb
hypernym: 02466737-v