charcoal-n
type: LexicalEntry
canonical form: charcoal
sense: 14709457-n
part of speech: noun

wood coal-n
type: LexicalEntry
canonical form: wood coal
sense: 14709457-n
part of speech: noun
sense: 14839433-n

14709457-n
type: LexicalConcept
in scheme: en-word.net
definition: a carbonaceous material obtained by heating wood or other organic matter in the absence of air
ili: i114153
lexfile: noun.substance
part of speech: noun
hypernym: 14899228-n
hypernym: 14657384-n

lignite-n
type: LexicalEntry
canonical form: lignite
sense: 14839433-n
part of speech: noun

brown coal-n
type: LexicalEntry
canonical form: brown coal
sense: 14839433-n
part of speech: noun

14839433-n
type: LexicalConcept
in scheme: en-word.net
definition: intermediate between peat and bituminous coal
ili: i114902
lexfile: noun.substance
part of speech: noun
hypernym: 14838786-n
hypernym: 14933128-n