wood-n
type: LexicalEntry
canonical form: wood
sense: 04604393-n
part of speech: noun
sense: 04605909-n
sense: 08455525-n
sense: 15122728-n

04604393-n
type: LexicalConcept
in scheme: en-word.net
definition: a golf club with a long shaft used to hit long shots; originally made with a wooden head
example: metal woods are now standard
ili: i61229
lexfile: noun.artifact
part of speech: noun
hypernym: 03451003-n

woodwind-n
type: LexicalEntry
canonical form: woodwind
sense: 04605909-n
part of speech: noun

woodwind instrument-n
type: LexicalEntry
canonical form: woodwind instrument
sense: 04605909-n
part of speech: noun

04605909-n
type: LexicalConcept
in scheme: en-word.net
definition: any wind instrument other than the brass instruments
ili: i61240
lexfile: noun.artifact
part of speech: noun
hypernym: 04594218-n
mero part: 03346795-n
mero part: 04438292-n

forest-n
type: LexicalEntry
canonical form: forest
sense: 08455525-n
part of speech: noun

woods-n
type: LexicalEntry
canonical form: woods
sense: 08455525-n
part of speech: noun

08455525-n
type: LexicalConcept
in scheme: en-word.net
definition: the trees and other plants in a large densely wooded area
ili: i81466
lexfile: noun.group
part of speech: noun
hypernym: 08453769-n
mero member: 08456468-n
mero member: 13124818-n

15122728-n
type: LexicalConcept
in scheme: en-word.net
definition: the hard fibrous lignified substance under the bark of trees
ili: i116549
lexfile: noun.substance
part of speech: noun
hypernym: 15016279-n
mero substance: 14959457-n