white wine-n
type: LexicalEntry
canonical form: white wine
sense: 07908788-n
part of speech: noun

07908788-n
type: LexicalConcept
in scheme: en-word.net
definition: pale yellowish wine made from white grapes or red grapes with skins removed before fermentation
ili: i78718
lexfile: noun.food
part of speech: noun
hypernym: 07907701-n