weld-v
type: LexicalEntry
canonical form: weld
sense: 00243862-v
part of speech: verb
sense: 01598751-v

00243862-v
type: LexicalConcept
in scheme: en-word.net
definition: unite closely or intimately
example: Her gratitude welded her to him
ili: i22932
lexfile: verb.change
part of speech: verb
hypernym: 00244010-v

01598751-v
type: LexicalConcept
in scheme: en-word.net
definition: join together by heating
example: weld metal
ili: i29715
lexfile: verb.contact
part of speech: verb
entails: 00395719-v
hypernym: 01293672-v

weld-n
type: LexicalEntry
canonical form: weld
sense: 04579244-n
part of speech: noun
sense: 12406347-n

04579244-n
type: LexicalConcept
in scheme: en-word.net
definition: a metal joint formed by softening with heat and fusing or hammering together
ili: i61074
lexfile: noun.artifact
part of speech: noun
hypernym: 03606190-n

dyer's rocket-n
type: LexicalEntry
canonical form: dyer's rocket
sense: 12406347-n
part of speech: noun

dyer's mignonette-n
type: LexicalEntry
canonical form: dyer's mignonette
sense: 12406347-n
part of speech: noun

Reseda luteola-n
type: LexicalEntry
canonical form: Reseda luteola
sense: 12406347-n
part of speech: noun

12406347-n
type: LexicalConcept
in scheme: en-word.net
definition: European mignonette cultivated as a source of yellow dye; naturalized in North America
ili: i102104
lexfile: noun.plant
part of speech: noun
hypernym: 12405946-n