wealth-n
type: LexicalEntry
canonical form: wealth
sense: 05123428-n
part of speech: noun
sense: 13271297-n
sense: 13374295-n
sense: 14514855-n

05123428-n
type: LexicalConcept
in scheme: en-word.net
definition: the quality of profuse abundance
example: she has a wealth of talent
ili: i63876
lexfile: noun.attribute
part of speech: noun
hypernym: 05122340-n

13271297-n
type: LexicalConcept
in scheme: en-word.net
definition: property that has economic utility: a monetary value or an exchange value
ili: i106279
lexfile: noun.possession
part of speech: noun
hypernym: 13265007-n

riches-n
type: LexicalEntry
canonical form: riches
sense: 13374295-n
part of speech: noun

13374295-n
type: LexicalConcept
in scheme: en-word.net
definition: an abundance of material possessions and resources
ili: i106878
lexfile: noun.possession
part of speech: noun
hypernym: 13374171-n

wealthiness-n
type: LexicalEntry
canonical form: wealthiness
sense: 14514855-n
part of speech: noun

14514855-n
type: LexicalConcept
in scheme: en-word.net
definition: the state of being rich and affluent; having a plentiful supply of material goods and money
example: great wealth is not a sign of great intelligence
ili: i113157
lexfile: noun.state
part of speech: noun
hypernym: 14511901-n