wan-v
type: LexicalEntry
canonical form: wan
sense: 00087405-v
part of speech: verb

00087405-v
type: LexicalConcept
in scheme: en-word.net
definition: become pale and sickly
ili: i22207
lexfile: verb.body
part of speech: verb
hypernym: 00087206-v

wan-a
type: LexicalEntry
canonical form: wan
sense: 00120560-s
part of speech: adjective
sense: 00406956-s
sense: 02333753-s

00120560-s
type: LexicalConcept
in scheme: en-word.net
definition: lacking vitality as from weariness or illness or unhappiness
example: a wan smile
ili: i632
lexfile: adj.all
part of speech: adjective satellite
similar: https://en-word.net/synset/00120219-a

pale-a
type: LexicalEntry
canonical form: pale
sense: 00406956-s
part of speech: adjective
sense: 02333753-s

pallid-a
type: LexicalEntry
canonical form: pallid
sense: 00406956-s
part of speech: adjective
sense: 02333753-s

00406956-s
type: LexicalConcept
in scheme: en-word.net
definition: abnormally deficient in color as suggesting physical or emotional distress
example: the pallid face of the invalid
example: her wan face suddenly flushed
ili: i2301
lexfile: adj.all
part of speech: adjective satellite
similar: https://en-word.net/synset/00405279-a

sick-a
type: LexicalEntry
canonical form: sick
sense: 02333753-s
part of speech: adjective

02333753-s
type: LexicalConcept
in scheme: en-word.net
definition: (of light) lacking in intensity or brightness; dim or feeble
example: the pale light of a half moon
example: a pale sun
example: the late afternoon light coming through the el tracks fell in pale oblongs on the street
example: a pallid sky
example: the pale (or wan) stars
example: the wan light of dawn
ili: i12883
lexfile: adj.all
part of speech: adjective satellite
similar: https://en-word.net/synset/02332106-a