walk through-v
type: LexicalEntry
canonical form: walk through
sense: 01727314-v
part of speech: verb

01727314-v
type: LexicalConcept
in scheme: en-word.net
definition: perform in a perfunctory way, as for a first rehearsal
ili: i30356
lexfile: verb.creation
part of speech: verb
hypernym: 01727101-v