vroom-v
type: LexicalEntry
canonical form: vroom
sense: 01048229-v
part of speech: verb

01048229-v
type: LexicalConcept
in scheme: en-word.net
definition: make a loud, roaring sound, as of a car engine, while moving
ili: i26802
lexfile: verb.communication
part of speech: verb
hypernym: 01047931-v

vroom-n
type: LexicalEntry
canonical form: vroom
sense: 07414220-n
part of speech: noun

07414220-n
type: LexicalConcept
in scheme: en-word.net
definition: the roaring sound made by a motor that is running at high speed
ili: i75588
lexfile: noun.event
part of speech: noun
hypernym: 07385893-n