verdict-n
type: LexicalEntry
canonical form: verdict
sense: 01194640-n
part of speech: noun

finding of fact-n
type: LexicalEntry
canonical form: finding of fact
sense: 01194640-n
part of speech: noun

01194640-n
type: LexicalConcept
in scheme: en-word.net
definition: (law) the findings of a jury on issues of fact submitted to it for decision; can be used in formulating a judgment
ili: i41636
lexfile: noun.act
part of speech: noun
domain topic: 08458195-n
hypernym: 01194465-n