veneering-n
type: LexicalEntry
canonical form: veneering
sense: 00928976-n
part of speech: noun
sense: 04532712-n

00928976-n
type: LexicalConcept
in scheme: en-word.net
definition: the act of applying veneer
ili: i40282
lexfile: noun.act
part of speech: noun
hypernym: 00928738-n

veneer-n
type: LexicalEntry
canonical form: veneer
sense: 04532712-n
part of speech: noun

04532712-n
type: LexicalConcept
in scheme: en-word.net
definition: coating consisting of a thin layer of superior wood glued to a base of inferior wood
ili: i60803
lexfile: noun.artifact
part of speech: noun
hypernym: 03062092-n