valued-a
type: LexicalEntry
canonical form: valued
sense: 01922372-s
part of speech: adjective
sense: 02597871-s

01922372-s
type: LexicalConcept
in scheme: en-word.net
definition: (usually used in combination) having value of a specified kind
example: triple-valued
ili: i10508
lexfile: adj.all
part of speech: adjective satellite
exemplifies: 06318142-n
similar: https://en-word.net/synset/01921311-a

precious-a
type: LexicalEntry
canonical form: precious
sense: 02597871-s
part of speech: adjective

02597871-s
type: LexicalConcept
in scheme: en-word.net
definition: held in great esteem for admirable qualities especially of an intrinsic nature
example: a valued friend
example: precious memories
ili: i14358
lexfile: adj.all
part of speech: adjective satellite
similar: https://en-word.net/synset/02595419-a