waltz-n
type: LexicalEntry
canonical form: waltz
sense: 00538571-n
part of speech: noun

valse-n
type: LexicalEntry
canonical form: valse
sense: 00538571-n
part of speech: noun

00538571-n
type: LexicalConcept
in scheme: en-word.net
definition: a ballroom dance in triple time with a strong accent on the first beat
ili: i38212
lexfile: noun.act
part of speech: noun
hypernym: 00535886-n