heedless-a
type: LexicalEntry
canonical form: heedless
sense: https://en-word.net/lemma/heedless-a#01197257-a
part of speech: adjective

unheeding-a
type: LexicalEntry
canonical form: unheeding
sense: https://en-word.net/lemma/unheeding-a#01197257-a
part of speech: adjective

https://en-word.net/synset/01197257-a
type: LexicalConcept
in scheme: en-word.net
definition: marked by or paying little heed or attention
example: We have always known that heedless self-interest was bad morals; we know now that it is bad economics
  source: Franklin D. Roosevelt
example: heedless of danger
example: heedless of the child's crying
ili: i6528
lexfile: adj.all
part of speech: adjective
attribute: 05710673-n
similar: 01197642-s
similar: 01197871-s