restlessness-n
type: LexicalEntry
canonical form: restlessness
sense: 04632641-n
part of speech: noun

uneasiness-n
type: LexicalEntry
canonical form: uneasiness
sense: 04632641-n
part of speech: noun
sense: 04912028-n
sense: 07522568-n
sense: 07540296-n
sense: 14470485-n

queasiness-n
type: LexicalEntry
canonical form: queasiness
sense: 04632641-n
part of speech: noun

04632641-n
type: LexicalConcept
in scheme: en-word.net
definition: inability to rest or relax or be still
ili: i61381
lexfile: noun.attribute
part of speech: noun
domain topic: 00845915-n
hypernym: 04632316-n

disquiet-n
type: LexicalEntry
canonical form: disquiet
sense: 04912028-n
part of speech: noun

unease-n
type: LexicalEntry
canonical form: unease
sense: 04912028-n
part of speech: noun
sense: 14470485-n

04912028-n
type: LexicalConcept
in scheme: en-word.net
definition: the trait of seeming ill at ease
ili: i62763
lexfile: noun.attribute
part of speech: noun
hypernym: 04911841-n

self-consciousness-n
type: LexicalEntry
canonical form: self-consciousness
sense: 07522568-n
part of speech: noun

uncomfortableness-n
type: LexicalEntry
canonical form: uncomfortableness
sense: 07522568-n
part of speech: noun

07522568-n
type: LexicalConcept
in scheme: en-word.net
definition: embarrassment deriving from the feeling that others are critically aware of you
ili: i76200
lexfile: noun.feeling
part of speech: noun
hypernym: 07522337-n

edginess-n
type: LexicalEntry
canonical form: edginess
sense: 07540296-n
part of speech: noun

inquietude-n
type: LexicalEntry
canonical form: inquietude
sense: 07540296-n
part of speech: noun

disquietude-n
type: LexicalEntry
canonical form: disquietude
sense: 07540296-n
part of speech: noun

07540296-n
type: LexicalConcept
in scheme: en-word.net
definition: feelings of anxiety that make you tense and irritable
ili: i76298
lexfile: noun.feeling
part of speech: noun
hypernym: 07539144-n

malaise-n
type: LexicalEntry
canonical form: malaise
sense: 14470485-n
part of speech: noun

14470485-n
type: LexicalConcept
in scheme: en-word.net
definition: physical discomfort (as mild sickness or depression)
ili: i112928
lexfile: noun.state
part of speech: noun
hypernym: 14470118-n