underlay-v
type: LexicalEntry
canonical form: underlay
sense: 01185721-v
part of speech: verb
sense: 01499931-v
sense: 01978930-v

01185721-v
type: LexicalConcept
in scheme: en-word.net
definition: provide with a base, support, lining, or backing
example: underlay the boards with joists
ili: i27533
lexfile: verb.consumption
part of speech: verb
hypernym: 01185006-v

01499931-v
type: LexicalConcept
in scheme: en-word.net
definition: put (something) under or beneath
example: They underlaid the shingles with roofing paper
ili: i29203
lexfile: verb.contact
part of speech: verb
hypernym: 01496967-v

01978930-v
type: LexicalConcept
in scheme: en-word.net
definition: raise or support (the level of printing) by inserting a piece of paper or cardboard under the type
example: underlay the plate
ili: i31601
lexfile: verb.motion
part of speech: verb
domain topic: 06690047-n
hypernym: 01978076-v

carpet pad-n
type: LexicalEntry
canonical form: carpet pad
sense: 02971078-n
part of speech: noun

rug pad-n
type: LexicalEntry
canonical form: rug pad
sense: 02971078-n
part of speech: noun

underlay-n
type: LexicalEntry
canonical form: underlay
sense: 02971078-n
part of speech: noun

underlayment-n
type: LexicalEntry
canonical form: underlayment
sense: 02971078-n
part of speech: noun

02971078-n
type: LexicalConcept
in scheme: en-word.net
definition: a pad placed under a carpet
ili: i51548
lexfile: noun.artifact
part of speech: noun
hypernym: 03878173-n