two-piece-a
type: LexicalEntry
canonical form: two-piece
sense: https://en-word.net/lemma/two-piece-a#01654479-a
part of speech: adjective

https://en-word.net/synset/01654479-a
type: LexicalConcept
in scheme: en-word.net
definition: (of clothing) made in or consisting of two parts or pieces
example: a two-piece swimsuit
ili: i9038
lexfile: adj.all
part of speech: adjective

bikini-n
type: LexicalEntry
canonical form: bikini
sense: 02841003-n
part of speech: noun

two-piece-n
type: LexicalEntry
canonical form: two-piece
sense: 02841003-n
part of speech: noun
sense: 04511436-n

02841003-n
type: LexicalConcept
in scheme: en-word.net
definition: a woman's very brief bathing suit
ili: i50755
lexfile: noun.artifact
part of speech: noun
hypernym: 04378650-n

two-piece suit-n
type: LexicalEntry
canonical form: two-piece suit
sense: 04511436-n
part of speech: noun

lounge suit-n
type: LexicalEntry
canonical form: lounge suit
sense: 04511436-n
part of speech: noun

04511436-n
type: LexicalConcept
in scheme: en-word.net
definition: a business suit consisting of a matching jacket and skirt or trousers
ili: i60680
lexfile: noun.artifact
part of speech: noun
hypernym: 02928903-n