cuff-n
type: LexicalEntry
canonical form: cuff
sense: 03150509-n
part of speech: noun

turnup-n
type: LexicalEntry
canonical form: turnup
sense: 03150509-n
part of speech: noun

03150509-n
type: LexicalConcept
in scheme: en-word.net
definition: the lap consisting of a turned-back hem encircling the end of the sleeve or leg
ili: i52600
lexfile: noun.artifact
part of speech: noun
hypernym: 03647020-n
mero part: 03320750-n