turbine-n
type: LexicalEntry
canonical form: turbine
sense: 04505818-n
part of speech: noun

04505818-n
type: LexicalConcept
in scheme: en-word.net
definition: rotary engine in which the kinetic energy of a moving fluid is converted into mechanical energy by causing a bladed rotor to rotate
ili: i60640
lexfile: noun.artifact
part of speech: noun
hypernym: 04117748-n
mero part: 02851761-n
mero part: 04119056-n
mero part: 04313730-n