tunnel-v
type: LexicalEntry
canonical form: tunnel
sense: 01446656-v
part of speech: verb
sense: 02045912-v

01446656-v
type: LexicalConcept
in scheme: en-word.net
definition: force a way through
ili: i28946
lexfile: verb.contact
part of speech: verb
hypernym: 01230239-v

burrow-v
type: LexicalEntry
canonical form: burrow
sense: 02045912-v
part of speech: verb

02045912-v
type: LexicalConcept
in scheme: en-word.net
definition: move through by or as by digging
example: burrow through the forest
ili: i31954
lexfile: verb.motion
part of speech: verb
hypernym: 01312361-v

tunnel-n
type: LexicalEntry
canonical form: tunnel
sense: 04505257-n
part of speech: noun
sense: 09252948-n

04505257-n
type: LexicalConcept
in scheme: en-word.net
definition: a passageway through or under something, usually underground (especially one for trains or cars)
example: the tunnel reduced congestion at that intersection
ili: i60637
lexfile: noun.artifact
part of speech: noun
domain topic: 02961779-n
hypernym: 03901282-n
mero part: 04189557-n

burrow-n
type: LexicalEntry
canonical form: burrow
sense: 09252948-n
part of speech: noun

09252948-n
type: LexicalConcept
in scheme: en-word.net
definition: a hole made by an animal, usually for shelter
ili: i85131
lexfile: noun.object
part of speech: noun
hypernym: 09327656-n