treasure hunt-n
type: LexicalEntry
canonical form: treasure hunt
sense: 00461767-n
part of speech: noun

00461767-n
type: LexicalConcept
in scheme: en-word.net
definition: a game in which players try to find hidden articles by using a series of clues
ili: i37838
lexfile: noun.act
part of speech: noun
hypernym: 00431591-n