transship-v
type: LexicalEntry
canonical form: transship
sense: 02017015-v
part of speech: verb

02017015-v
type: LexicalConcept
in scheme: en-word.net
definition: transfer for further transportation from one ship or conveyance to another
ili: i31803
lexfile: verb.motion
part of speech: verb
hypernym: 02016196-v