towel-v
type: LexicalEntry
canonical form: towel
sense: 01396989-v
part of speech: verb

01396989-v
type: LexicalConcept
in scheme: en-word.net
definition: wipe with a towel
example: towel your hair dry
ili: i28689
lexfile: verb.contact
part of speech: verb
hypernym: 01394891-v

towel-n
type: LexicalEntry
canonical form: towel
sense: 04466597-n
part of speech: noun

04466597-n
type: LexicalConcept
in scheme: en-word.net
definition: a rectangular piece of absorbent cloth (or paper) for drying or wiping
ili: i60410
lexfile: noun.artifact
part of speech: noun
hypernym: 03938946-n