tootle-v
type: LexicalEntry
canonical form: tootle
sense: 02187888-v
part of speech: verb

02187888-v
type: LexicalConcept
in scheme: en-word.net
definition: play (a musical instrument) casually
example: the saxophone player was tootling a sad melody
ili: i32670
lexfile: verb.perception
part of speech: verb
hypernym: 02187621-v

tootle-n
type: LexicalEntry
canonical form: tootle
sense: 07412962-n
part of speech: noun

07412962-n
type: LexicalConcept
in scheme: en-word.net
definition: the sound of casual playing on a musical instrument
example: he enjoyed hearing the tootles of their horns as the musicians warmed up
ili: i75580
lexfile: noun.event
part of speech: noun
hypernym: 07385893-n