tomentum-n
type: LexicalEntry
canonical form: tomentum
sense: 05255349-n
part of speech: noun

tomentum cerebri-n
type: LexicalEntry
canonical form: tomentum cerebri
sense: 05255349-n
part of speech: noun

05255349-n
type: LexicalConcept
in scheme: en-word.net
definition: a network of tiny blood vessels between the cerebral surface of the pia mater and the cerebral cortex
ili: i64534
lexfile: noun.body
part of speech: noun
hypernym: 05433487-n