toggle-v
type: LexicalEntry
canonical form: toggle
sense: 01477705-v
part of speech: verb
sense: 01610908-v
sense: 02362560-v

01477705-v
type: LexicalConcept
in scheme: en-word.net
definition: release by a toggle switch
example: toggle a bomb from an airplane
ili: i29092
lexfile: verb.contact
part of speech: verb
hypernym: 01477180-v

01610908-v
type: LexicalConcept
in scheme: en-word.net
definition: fasten with, or as if with, a toggle
ili: i29794
lexfile: verb.contact
part of speech: verb
hypernym: 01343121-v

02362560-v
type: LexicalConcept
in scheme: en-word.net
definition: provide with a toggle or toggles
ili: i33537
lexfile: verb.possession
part of speech: verb
hypernym: 02332196-v

toggle-n
type: LexicalEntry
canonical form: toggle
sense: 04452461-n
part of speech: noun
sense: 04453086-n
sense: 06599575-n

04452461-n
type: LexicalConcept
in scheme: en-word.net
definition: a fastener consisting of a peg or pin or crosspiece that is inserted into an eye at the end of a rope or a chain or a cable in order to fasten it to something (as another rope or chain or cable)
ili: i60328
lexfile: noun.artifact
part of speech: noun
hypernym: 03328648-n

toggle switch-n
type: LexicalEntry
canonical form: toggle switch
sense: 04453086-n
part of speech: noun

on-off switch-n
type: LexicalEntry
canonical form: on-off switch
sense: 04453086-n
part of speech: noun

on/off switch-n
type: LexicalEntry
canonical form: on/off switch
sense: 04453086-n
part of speech: noun

04453086-n
type: LexicalConcept
in scheme: en-word.net
definition: a hinged switch that can assume either of two positions
ili: i60331
lexfile: noun.artifact
part of speech: noun
hypernym: 04379457-n

06599575-n
type: LexicalConcept
in scheme: en-word.net
definition: any instruction that works first one way and then the other; it turns something on the first time it is used and then turns it off the next time
ili: i71074
lexfile: noun.communication
part of speech: noun
hypernym: 06597067-n