tester-n
type: LexicalEntry
canonical form: tester
sense: 04422489-n
part of speech: noun
sense: 10088041-n

04422489-n
type: LexicalConcept
in scheme: en-word.net
definition: a flat canopy (especially one over a four-poster bed)
ili: i60146
lexfile: noun.artifact
part of speech: noun
hypernym: 02955279-n

examiner-n
type: LexicalEntry
canonical form: examiner
sense: 10088041-n
part of speech: noun

quizzer-n
type: LexicalEntry
canonical form: quizzer
sense: 10088041-n
part of speech: noun

10088041-n
type: LexicalConcept
in scheme: en-word.net
definition: someone who administers a test to determine your qualifications
ili: i89825
lexfile: noun.person
part of speech: noun
hypernym: 10227450-n