shattered-a
type: LexicalEntry
canonical form: shattered
sense: 00740215-s
part of speech: adjective

tattered-a
type: LexicalEntry
canonical form: tattered
sense: 00740215-s
part of speech: adjective
sense: 02594057-s

00740215-s
type: LexicalConcept
in scheme: en-word.net
definition: ruined or disrupted
example: our shattered dreams of peace and prosperity
example: a tattered remnant of its former strength
example: my torn and tattered past
ili: i4079
lexfile: adj.all
part of speech: adjective satellite
similar: https://en-word.net/synset/00737862-a

tatterdemalion-a
type: LexicalEntry
canonical form: tatterdemalion
sense: 02594057-s
part of speech: adjective

02594057-s
type: LexicalConcept
in scheme: en-word.net
definition: worn to shreds; or wearing torn or ragged clothing
example: a man in a tattered shirt
example: the tattered flag
example: tied up in tattered brown paper
example: a tattered barefoot boy
example: a tatterdemalion prince
ili: i14337
lexfile: adj.all
part of speech: adjective satellite
similar: https://en-word.net/synset/02590887-a