tan-v
type: LexicalEntry
canonical form: tan
sense: 00103629-v
part of speech: verb
sense: 00512511-v

bronze-v
type: LexicalEntry
canonical form: bronze
sense: 00103629-v
part of speech: verb

00103629-v
type: LexicalConcept
in scheme: en-word.net
definition: get a tan, from wind or sun
ili: i22292
lexfile: verb.body
part of speech: verb
hypernym: 00281861-v

tan-a
type: LexicalEntry
canonical form: tan
sense: 00385595-s
part of speech: adjective

00385595-s
type: LexicalConcept
in scheme: en-word.net
definition: of a light yellowish-brown color
ili: i2159
lexfile: adj.all
part of speech: adjective satellite
similar: https://en-word.net/synset/00367771-a

00512511-v
type: LexicalConcept
in scheme: en-word.net
definition: treat skins and hides with tannic acid so as to convert them into leather
ili: i24274
lexfile: verb.change
part of speech: verb
hypernym: 00114965-v

tan-n
type: LexicalEntry
canonical form: tan
sense: 04980287-n
part of speech: noun
sense: 13810247-n
sense: 14314036-n

topaz-n
type: LexicalEntry
canonical form: topaz
sense: 04980287-n
part of speech: noun

04980287-n
type: LexicalConcept
in scheme: en-word.net
definition: a light brown the color of topaz
ili: i63128
lexfile: noun.attribute
part of speech: noun
hypernym: 04980068-n

tangent-n
type: LexicalEntry
canonical form: tangent
sense: 13810247-n
part of speech: noun

13810247-n
type: LexicalConcept
in scheme: en-word.net
definition: ratio of the opposite to the adjacent side of a right-angled triangle
ili: i109362
lexfile: noun.relation
part of speech: noun
hypernym: 13809172-n

suntan-n
type: LexicalEntry
canonical form: suntan
sense: 14314036-n
part of speech: noun

14314036-n
type: LexicalConcept
in scheme: en-word.net
definition: a browning of the skin resulting from exposure to the rays of the sun
ili: i112055
lexfile: noun.state
part of speech: noun
hypernym: 14314383-n