tabun-n
type: LexicalEntry
canonical form: tabun
sense: 15090692-n
part of speech: noun

GA-n
type: LexicalEntry
canonical form: GA
sense: 15090692-n
part of speech: noun

15090692-n
type: LexicalConcept
in scheme: en-word.net
definition: the first known nerve agent, synthesized by German chemists in 1936; a highly toxic combustible liquid that is soluble in organic solvents and is used as a nerve gas in chemical warfare
ili: i116354
lexfile: noun.substance
part of speech: noun
hypernym: 14994695-n
hypernym: 92433710-n