synthesize-v
type: LexicalEntry
canonical form: synthesize
sense: 00645728-v
part of speech: verb
sense: 00646092-v

synthesise-v
type: LexicalEntry
canonical form: synthesise
sense: 00645728-v
part of speech: verb

00645728-v
type: LexicalConcept
in scheme: en-word.net
definition: combine so as to form a more complex, product
example: his operas synthesize music and drama in perfect harmony
example: The liver synthesizes vitamins
ili: i24955
lexfile: verb.cognition
part of speech: verb
hypernym: 00193830-v

00646092-v
type: LexicalConcept
in scheme: en-word.net
definition: combine and form a synthesis
example: Vitamin D only synthesizes when sunlight is available
ili: i24956
lexfile: verb.cognition
part of speech: verb
hypernym: 00109468-v