sweeten-v
type: LexicalEntry
canonical form: sweeten
sense: 00520934-v
part of speech: verb
sense: 02199916-v

00520934-v
type: LexicalConcept
in scheme: en-word.net
definition: make sweeter, more pleasant, or more agreeable
example: sweeten a deal
ili: i24315
lexfile: verb.change
part of speech: verb
hypernym: 00126072-v

dulcify-v
type: LexicalEntry
canonical form: dulcify
sense: 02199916-v
part of speech: verb

edulcorate-v
type: LexicalEntry
canonical form: edulcorate
sense: 02199916-v
part of speech: verb

dulcorate-v
type: LexicalEntry
canonical form: dulcorate
sense: 02199916-v
part of speech: verb

02199916-v
type: LexicalConcept
in scheme: en-word.net
definition: make sweeter in taste
ili: i32730
lexfile: verb.perception
part of speech: verb
hypernym: 02201394-v