muskmelon-n
type: LexicalEntry
canonical form: muskmelon
sense: 07771683-n
part of speech: noun
sense: 12184880-n

sweet melon-n
type: LexicalEntry
canonical form: sweet melon
sense: 07771683-n
part of speech: noun
sense: 12184880-n

07771683-n
type: LexicalConcept
in scheme: en-word.net
definition: the fruit of a muskmelon vine; any of several sweet melons related to cucumbers
ili: i77816
lexfile: noun.food
part of speech: noun
hypernym: 07771387-n

sweet melon vine-n
type: LexicalEntry
canonical form: sweet melon vine
sense: 12184880-n
part of speech: noun

Cucumis melo-n
type: LexicalEntry
canonical form: Cucumis melo
sense: 12184880-n
part of speech: noun

12184880-n
type: LexicalConcept
in scheme: en-word.net
definition: any of several varieties of vine whose fruit has a netted rind and edible flesh and a musky smell
ili: i101070
lexfile: noun.plant
part of speech: noun
hypernym: 12184341-n
mero part: 07771683-n