surtout-n
type: LexicalEntry
canonical form: surtout
sense: 04372316-n
part of speech: noun

04372316-n
type: LexicalConcept
in scheme: en-word.net
definition: a man's overcoat in the style of a frock coat
ili: i59845
lexfile: noun.artifact
part of speech: noun
hypernym: 03461607-n