arbiter-n
type: LexicalEntry
canonical form: arbiter
sense: 09823476-n
part of speech: noun

supreme authority-n
type: LexicalEntry
canonical form: supreme authority
sense: 09823476-n
part of speech: noun

09823476-n
type: LexicalConcept
in scheme: en-word.net
definition: someone with the power to settle matters at will
example: she was the final arbiter on all matters of fashion
ili: i88274
lexfile: noun.person
part of speech: noun
hypernym: 09640897-n