documentation-n
type: LexicalEntry
canonical form: documentation
sense: 00155253-n
part of speech: noun

support-n
type: LexicalEntry
canonical form: support
sense: 00155253-n
part of speech: noun
sense: 00973567-n
sense: 01019262-n
sense: 01215009-n
sense: 01218392-n
sense: 04366676-n
sense: 04367588-n
sense: 05701884-n
sense: 07045239-n
sense: 13386459-n
sense: 13386871-n

00155253-n
type: LexicalConcept
in scheme: en-word.net
definition: documentary validation
example: his documentation of the results was excellent
example: the strongest support for this view is the work of Jones
ili: i36225
lexfile: noun.act
part of speech: noun
hypernym: 00154781-n

confirm-v
type: LexicalEntry
canonical form: confirm
sense: 00667804-v
part of speech: verb

corroborate-v
type: LexicalEntry
canonical form: corroborate
sense: 00667804-v
part of speech: verb
sense: 02669418-v

sustain-v
type: LexicalEntry
canonical form: sustain
sense: 00667804-v
part of speech: verb
sense: 01219607-v

substantiate-v
type: LexicalEntry
canonical form: substantiate
sense: 00667804-v
part of speech: verb

support-v
type: LexicalEntry
canonical form: support
sense: 00667804-v
part of speech: verb
sense: 00670017-v
sense: 00807976-v
sense: 00896689-v
sense: 00910574-v
sense: 01219607-v
sense: 01724650-v
sense: 02223876-v
sense: 02459338-v
sense: 02561834-v
sense: 02669418-v

affirm-v
type: LexicalEntry
canonical form: affirm
sense: 00667804-v
part of speech: verb

00667804-v
type: LexicalConcept
in scheme: en-word.net
definition: establish or strengthen as with new evidence or facts
example: his story confirmed my doubts
example: The evidence supports the defendant
ili: i25055
lexfile: verb.cognition
part of speech: verb
hypernym: 02372362-v

digest-v
type: LexicalEntry
canonical form: digest
sense: 00670017-v
part of speech: verb

endure-v
type: LexicalEntry
canonical form: endure
sense: 00670017-v
part of speech: verb

stick out-v
type: LexicalEntry
canonical form: stick out
sense: 00670017-v
part of speech: verb

stomach-v
type: LexicalEntry
canonical form: stomach
sense: 00670017-v
part of speech: verb

bear-v
type: LexicalEntry
canonical form: bear
sense: 00670017-v
part of speech: verb

stand-v
type: LexicalEntry
canonical form: stand
sense: 00670017-v
part of speech: verb

tolerate-v
type: LexicalEntry
canonical form: tolerate
sense: 00670017-v
part of speech: verb

brook-v
type: LexicalEntry
canonical form: brook
sense: 00670017-v
part of speech: verb

abide-v
type: LexicalEntry
canonical form: abide
sense: 00670017-v
part of speech: verb

suffer-v
type: LexicalEntry
canonical form: suffer
sense: 00670017-v
part of speech: verb

put up-v
type: LexicalEntry
canonical form: put up
sense: 00670017-v
part of speech: verb

00670017-v
type: LexicalConcept
in scheme: en-word.net
definition: put up with something or somebody unpleasant
example: I cannot bear his constant criticism
example: The new secretary had to endure a lot of unprofessional remarks
example: he learned to tolerate the heat
example: She stuck out two years in a miserable marriage
ili: i25064
lexfile: verb.cognition
part of speech: verb
hypernym: 00803980-v
similar: 00064841-v

subscribe-v
type: LexicalEntry
canonical form: subscribe
sense: 00807976-v
part of speech: verb

00807976-v
type: LexicalConcept
in scheme: en-word.net
definition: adopt as a belief
example: I subscribe to your view on abortion
ili: i25699
lexfile: verb.communication
part of speech: verb
entails: 00808164-v
hypernym: 00807038-v

defend-v
type: LexicalEntry
canonical form: defend
sense: 00896689-v
part of speech: verb

fend for-v
type: LexicalEntry
canonical form: fend for
sense: 00896689-v
part of speech: verb

00896689-v
type: LexicalConcept
in scheme: en-word.net
definition: argue or speak in defense of
example: She supported the motion to strike
ili: i26092
lexfile: verb.communication
part of speech: verb
hypernym: 00774234-v

patronize-v
type: LexicalEntry
canonical form: patronize
sense: 00910574-v
part of speech: verb

patronise-v
type: LexicalEntry
canonical form: patronise
sense: 00910574-v
part of speech: verb

patronage-v
type: LexicalEntry
canonical form: patronage
sense: 00910574-v
part of speech: verb

keep going-v
type: LexicalEntry
canonical form: keep going
sense: 00910574-v
part of speech: verb

00910574-v
type: LexicalConcept
in scheme: en-word.net
definition: be a regular customer or client of
example: We patronize this store
example: Our sponsor kept our art studio going for as long as he could
ili: i26157
lexfile: verb.communication
part of speech: verb
hypernym: 00910304-v
similar: 02690077-v

reinforcement-n
type: LexicalEntry
canonical form: reinforcement
sense: 00973567-n
part of speech: noun

reenforcement-n
type: LexicalEntry
canonical form: reenforcement
sense: 00973567-n
part of speech: noun

00973567-n
type: LexicalConcept
in scheme: en-word.net
definition: a military operation (often involving new supplies of men and materiel) to strengthen a military force or aid in the performance of its mission
example: they called for artillery support
ili: i40490
lexfile: noun.act
part of speech: noun
domain topic: 08215965-n
hypernym: 00957171-n

supporting-n
type: LexicalEntry
canonical form: supporting
sense: 01019262-n
part of speech: noun

01019262-n
type: LexicalConcept
in scheme: en-word.net
definition: the act of bearing the weight of or strengthening
example: he leaned against the wall for support
ili: i40733
lexfile: noun.act
part of speech: noun
hypernym: 00408356-n

01215009-n
type: LexicalConcept
in scheme: en-word.net
definition: aiding the cause or policy or interests of
example: the president no longer has the support of his own party
example: they developed a scheme of mutual support
ili: i41740
lexfile: noun.act
part of speech: noun
hypernym: 01210099-n

01218392-n
type: LexicalConcept
in scheme: en-word.net
definition: the activity of providing for or maintaining by supplying with money or necessities
example: his support kept the family together
example: they gave him emotional support during difficult times
ili: i41756
lexfile: noun.act
part of speech: noun
hypernym: 00408356-n

hold-v
type: LexicalEntry
canonical form: hold
sense: 01219607-v
part of speech: verb

hold up-v
type: LexicalEntry
canonical form: hold up
sense: 01219607-v
part of speech: verb

01219607-v
type: LexicalConcept
in scheme: en-word.net
definition: be the physical support of; carry the weight of
example: The beam holds up the roof
example: He supported me with one hand while I balanced on the beam
example: What's holding that mirror?
ili: i27707
lexfile: verb.contact
part of speech: verb
hypernym: 02372362-v

01724650-v
type: LexicalConcept
in scheme: en-word.net
definition: play a subordinate role to (another performer)
example: Olivier supported Gielgud beautifully in the second act
ili: i30343
lexfile: verb.creation
part of speech: verb
domain topic: 07019235-n
hypernym: 01723161-v

02223876-v
type: LexicalConcept
in scheme: en-word.net
definition: support materially or financially
example: he does not support his natural children
example: The scholarship supported me when I was in college
ili: i32841
lexfile: verb.possession
part of speech: verb
hypernym: 02204104-v

back-v
type: LexicalEntry
canonical form: back
sense: 02459338-v
part of speech: verb

endorse-v
type: LexicalEntry
canonical form: endorse
sense: 02459338-v
part of speech: verb

indorse-v
type: LexicalEntry
canonical form: indorse
sense: 02459338-v
part of speech: verb

plump for-v
type: LexicalEntry
canonical form: plump for
sense: 02459338-v
part of speech: verb

plunk for-v
type: LexicalEntry
canonical form: plunk for
sense: 02459338-v
part of speech: verb

02459338-v
type: LexicalConcept
in scheme: en-word.net
definition: be behind; approve of
example: He plumped for the Labor Party
example: I backed Kennedy in 1960
ili: i33992
lexfile: verb.social
part of speech: verb
hypernym: 00808164-v
similar: 02562643-v

back up-v
type: LexicalEntry
canonical form: back up
sense: 02561834-v
part of speech: verb

02561834-v
type: LexicalConcept
in scheme: en-word.net
definition: give moral or psychological support, aid, or courage to
example: She supported him during the illness
example: Her children always backed her up
ili: i34473
lexfile: verb.social
part of speech: verb
hypernym: 02372362-v

underpin-v
type: LexicalEntry
canonical form: underpin
sense: 02669418-v
part of speech: verb

bear out-v
type: LexicalEntry
canonical form: bear out
sense: 02669418-v
part of speech: verb

02669418-v
type: LexicalConcept
in scheme: en-word.net
definition: support with evidence or authority or make more certain or confirm
example: The stories and claims were born out by the evidence
ili: i34981
lexfile: verb.stative
part of speech: verb
hypernym: 02663315-v

04366676-n
type: LexicalConcept
in scheme: en-word.net
definition: any device that bears the weight of another thing
example: there was no place to attach supports for a shelf
ili: i59816
lexfile: noun.artifact
part of speech: noun
hypernym: 03187746-n

04367588-n
type: LexicalConcept
in scheme: en-word.net
definition: supporting structure that holds up or provides a foundation
example: the statue stood on a marble support
ili: i59817
lexfile: noun.artifact
part of speech: noun
hypernym: 04368182-n

05701884-n
type: LexicalConcept
in scheme: en-word.net
definition: something providing immaterial assistance to a person or cause or interest
example: the policy found little public support
example: his faith was all the support he needed
example: the team enjoyed the support of their fans
ili: i66837
lexfile: noun.cognition
part of speech: noun
hypernym: 05700875-n

accompaniment-n
type: LexicalEntry
canonical form: accompaniment
sense: 07045239-n
part of speech: noun

musical accompaniment-n
type: LexicalEntry
canonical form: musical accompaniment
sense: 07045239-n
part of speech: noun

backup-n
type: LexicalEntry
canonical form: backup
sense: 07045239-n
part of speech: noun

07045239-n
type: LexicalConcept
in scheme: en-word.net
definition: a musical part (vocal or instrumental) that supports or provides background for other musical parts
ili: i73606
lexfile: noun.communication
part of speech: noun
hypernym: 07044205-n

keep-n
type: LexicalEntry
canonical form: keep
sense: 13386459-n
part of speech: noun

livelihood-n
type: LexicalEntry
canonical form: livelihood
sense: 13386459-n
part of speech: noun

living-n
type: LexicalEntry
canonical form: living
sense: 13386459-n
part of speech: noun

bread and butter-n
type: LexicalEntry
canonical form: bread and butter
sense: 13386459-n
part of speech: noun

sustenance-n
type: LexicalEntry
canonical form: sustenance
sense: 13386459-n
part of speech: noun

13386459-n
type: LexicalConcept
in scheme: en-word.net
definition: the financial means whereby one lives
example: each child was expected to pay for their keep
example: he applied to the state for support
example: he could no longer earn his own livelihood
ili: i106945
lexfile: noun.possession
part of speech: noun
hypernym: 13352793-n

financial support-n
type: LexicalEntry
canonical form: financial support
sense: 13386871-n
part of speech: noun

funding-n
type: LexicalEntry
canonical form: funding
sense: 13386871-n
part of speech: noun

backing-n
type: LexicalEntry
canonical form: backing
sense: 13386871-n
part of speech: noun

financial backing-n
type: LexicalEntry
canonical form: financial backing
sense: 13386871-n
part of speech: noun

13386871-n
type: LexicalConcept
in scheme: en-word.net
definition: financial resources provided to make some project possible
example: the foundation provided support for the experiment
ili: i106946
lexfile: noun.possession
part of speech: noun
hypernym: 13352793-n