supplementary-a
type: LexicalEntry
canonical form: supplementary
sense: 00050099-s
part of speech: adjective
sense: 01860057-s

supplemental-a
type: LexicalEntry
canonical form: supplemental
sense: 00050099-s
part of speech: adjective
sense: 01860057-s

00050099-s
type: LexicalConcept
in scheme: en-word.net
definition: added to complete or make up a deficiency
example: produced supplementary volumes
ili: i257
lexfile: adj.all
part of speech: adjective satellite
similar: https://en-word.net/synset/00048349-a

auxiliary-a
type: LexicalEntry
canonical form: auxiliary
sense: 01860057-s
part of speech: adjective

subsidiary-a
type: LexicalEntry
canonical form: subsidiary
sense: 01860057-s
part of speech: adjective

01860057-s
type: LexicalConcept
in scheme: en-word.net
definition: functioning in a supporting capacity
example: the main library and its auxiliary branches
ili: i10184
lexfile: adj.all
part of speech: adjective satellite
similar: https://en-word.net/synset/01859389-a