append-v
type: LexicalEntry
canonical form: append
sense: 01331387-v
part of speech: verb

add on-v
type: LexicalEntry
canonical form: add on
sense: 01331387-v
part of speech: verb

supplement-v
type: LexicalEntry
canonical form: supplement
sense: 01331387-v
part of speech: verb
sense: 02347128-v
sense: 02758806-v

affix-v
type: LexicalEntry
canonical form: affix
sense: 01331387-v
part of speech: verb

01331387-v
type: LexicalConcept
in scheme: en-word.net
definition: add to the very end
example: He appended a glossary to his novel where he used an invented language
ili: i28328
lexfile: verb.contact
part of speech: verb
hypernym: 01299048-v

02347128-v
type: LexicalConcept
in scheme: en-word.net
definition: add as a supplement to what seems insufficient
example: supplement your diet
ili: i33451
lexfile: verb.possession
part of speech: verb
entails: 02332196-v
hypernym: 00182551-v
similar: 02758806-v

accessory-n
type: LexicalEntry
canonical form: accessory
sense: 02674051-n
part of speech: noun

appurtenance-n
type: LexicalEntry
canonical form: appurtenance
sense: 02674051-n
part of speech: noun

supplement-n
type: LexicalEntry
canonical form: supplement
sense: 02674051-n
part of speech: noun
sense: 05118072-n
sense: 06411274-n

add-on-n
type: LexicalEntry
canonical form: add-on
sense: 02674051-n
part of speech: noun

02674051-n
type: LexicalConcept
in scheme: en-word.net
definition: a supplementary component that improves capability
ili: i49788
lexfile: noun.artifact
part of speech: noun
hypernym: 03085025-n

02758806-v
type: LexicalConcept
in scheme: en-word.net
definition: serve as a supplement to
example: Vitamins supplemented his meager diet
ili: i35442
lexfile: verb.stative
part of speech: verb
hypernym: 02626667-v
similar: 02347128-v

supplementation-n
type: LexicalEntry
canonical form: supplementation
sense: 05118072-n
part of speech: noun

05118072-n
type: LexicalConcept
in scheme: en-word.net
definition: a quantity added (e.g. to make up for a deficiency)
ili: i63853
lexfile: noun.attribute
part of speech: noun
hypernym: 05116247-n

addendum-n
type: LexicalEntry
canonical form: addendum
sense: 06411274-n
part of speech: noun

postscript-n
type: LexicalEntry
canonical form: postscript
sense: 06411274-n
part of speech: noun

06411274-n
type: LexicalConcept
in scheme: en-word.net
definition: textual matter that is added onto a publication; usually at the end
ili: i70113
lexfile: noun.communication
part of speech: noun
hypernym: 06376912-n