supplanting-n
type: LexicalEntry
canonical form: supplanting
sense: 00198459-n
part of speech: noun

displacement-n
type: LexicalEntry
canonical form: displacement
sense: 00198459-n
part of speech: noun

00198459-n
type: LexicalConcept
in scheme: en-word.net
definition: act of taking the place of another especially using underhanded tactics
ili: i36448
lexfile: noun.act
part of speech: noun
hypernym: 00198621-n