sun visor-n
type: LexicalEntry
canonical form: sun visor
sense: 04364882-n
part of speech: noun

04364882-n
type: LexicalConcept
in scheme: en-word.net
definition: a shade (sometimes of green mica) affixed above the windshield of an automobile
ili: i59803
lexfile: noun.artifact
part of speech: noun
hypernym: 04188779-n